Target
Cannabinoid receptor 1
Ligand
BDBM50324632
Substrate
Meas. Tech.
ChEMBL_649739 (CHEMBL1219437)
Ki
460±n/a nM
Citation
 Pasquini, SLigresti, AMugnaini, CSemeraro, TCicione, LDe Rosa, MGuida, FLuongo, LDe Chiaro, MCascio, MGBolognini, DMarini, PPertwee, RMaione, SDi Marzo, VCorelli, F Investigations on the 4-quinolone-3-carboxylic acid motif. 3. Synthesis, structure-affinity relationships, and pharmacological characterization of 6-substituted 4-quinolone-3-carboxamides as highly selective cannabinoid-2 receptor ligands. J Med Chem 53:5915-28 (2010)  
Target
Name:
Cannabinoid receptor 1
Synonyms:
CANN6 CB-R CNR CNR1_HUMAN Cannabinoid receptor Cannabinoid receptor 1 (brain)
Type:
G Protein-Coupled Receptor (GPCR)
Mol. Mass.:
52868.96
Organism:
Homo sapiens (Human)
Description:
P21554
Residue:
472
  
Inhibitor
Name:
BDBM50324632
Synonyms:
CHEMBL1215953 | N-(Adamantan-1-yl)-4-oxo-1-pentyl-6-(phenylsulfinyl)-1,4-dihydroquinoline-3-carboxamide
Type:
Small organic molecule
Emp. Form.:
C31H36N2O3S
Mol. Mass.:
516.694
SMILES:
CCCCCn1cc(C(=O)NC23CC4CC(CC(C4)C2)C3)c(=O)c2cc(ccc12)S(=O)c1ccccc1
: