Target
Cannabinoid receptor 1
Ligand
BDBM50324660
Substrate
Meas. Tech.
ChEMBL_649739 (CHEMBL1219437)
Ki
1700±n/a nM
Citation
 Pasquini, SLigresti, AMugnaini, CSemeraro, TCicione, LDe Rosa, MGuida, FLuongo, LDe Chiaro, MCascio, MGBolognini, DMarini, PPertwee, RMaione, SDi Marzo, VCorelli, F Investigations on the 4-quinolone-3-carboxylic acid motif. 3. Synthesis, structure-affinity relationships, and pharmacological characterization of 6-substituted 4-quinolone-3-carboxamides as highly selective cannabinoid-2 receptor ligands. J Med Chem 53:5915-28 (2010)  
Target
Name:
Cannabinoid receptor 1
Synonyms:
CANN6 CB-R CNR CNR1_HUMAN Cannabinoid receptor Cannabinoid receptor 1 (brain)
Type:
G Protein-Coupled Receptor (GPCR)
Mol. Mass.:
52868.96
Organism:
Homo sapiens (Human)
Description:
P21554
Residue:
472
  
Inhibitor
Name:
BDBM50324660
Synonyms:
6-Bromo-4-oxo-1-pentyl-1,4-dihydro-quinoline-3-carboxylic acid cyclohexylamide | CHEMBL1215993
Type:
Small organic molecule
Emp. Form.:
C21H27BrN2O2
Mol. Mass.:
419.355
SMILES:
CCCCCn1cc(C(=O)NC2CCCCC2)c(=O)c2cc(Br)ccc12
: