Target
Cannabinoid receptor 2
Ligand
BDBM50324651
Substrate
Meas. Tech.
ChEMBL_649740 (CHEMBL1219438)
Ki
65.4±n/a nM
Citation
 Pasquini, SLigresti, AMugnaini, CSemeraro, TCicione, LDe Rosa, MGuida, FLuongo, LDe Chiaro, MCascio, MGBolognini, DMarini, PPertwee, RMaione, SDi Marzo, VCorelli, F Investigations on the 4-quinolone-3-carboxylic acid motif. 3. Synthesis, structure-affinity relationships, and pharmacological characterization of 6-substituted 4-quinolone-3-carboxamides as highly selective cannabinoid-2 receptor ligands. J Med Chem 53:5915-28 (2010)  
Target
Name:
Cannabinoid receptor 2
Synonyms:
CANNABINOID CB2 CB2 CB2B CNR2_HUMAN Cannabinoid CB2 receptor Cannabinoid receptor 2 (CB2R) | hCB2
Type:
G Protein-Coupled Receptor (GPCR)
Mol. Mass.:
39690.94
Organism:
Homo sapiens (Human)
Description:
P34972
Residue:
360
  
Inhibitor
Name:
BDBM50324651
Synonyms:
(E)-N-(Adamantan-1-yl)-4-oxo-1-pentyl-6-styryl-1,4-dihydroquinoline-3-carboxamide | CHEMBL1215954
Type:
Small organic molecule
Emp. Form.:
C33H38N2O2
Mol. Mass.:
494.667
SMILES:
CCCCCn1cc(C(=O)NC23CC4CC(CC(C4)C2)C3)c(=O)c2cc(\C=C\c3ccccc3)ccc12
: