Target
Cannabinoid receptor 2
Ligand
BDBM50324662
Substrate
Meas. Tech.
ChEMBL_649740 (CHEMBL1219438)
Ki
4.4±n/a nM
Citation
 Pasquini, SLigresti, AMugnaini, CSemeraro, TCicione, LDe Rosa, MGuida, FLuongo, LDe Chiaro, MCascio, MGBolognini, DMarini, PPertwee, RMaione, SDi Marzo, VCorelli, F Investigations on the 4-quinolone-3-carboxylic acid motif. 3. Synthesis, structure-affinity relationships, and pharmacological characterization of 6-substituted 4-quinolone-3-carboxamides as highly selective cannabinoid-2 receptor ligands. J Med Chem 53:5915-28 (2010)  
Target
Name:
Cannabinoid receptor 2
Synonyms:
CANNABINOID CB2 CB2 CB2B CNR2_HUMAN Cannabinoid CB2 receptor Cannabinoid receptor 2 (CB2R) | hCB2
Type:
G Protein-Coupled Receptor (GPCR)
Mol. Mass.:
39690.94
Organism:
Homo sapiens (Human)
Description:
P34972
Residue:
360
  
Inhibitor
Name:
BDBM50324662
Synonyms:
1-But-3-enyl-6-furan-2-yl-4-oxo-1,4-dihydro-quinoline-3-carboxylic acid adamantan-1-ylamide | CHEMBL1216000
Type:
Small organic molecule
Emp. Form.:
C28H30N2O3
Mol. Mass.:
442.5494
SMILES:
C=CCCn1cc(C(=O)NC23CC4CC(CC(C4)C2)C3)c(=O)c2cc(ccc12)-c1ccco1
: