Target
Galectin-7
Ligand
BDBM50326596
Substrate
Meas. Tech.
ChEMBL_661836 (CHEMBL1252152)
Kd
3400±n/a nM
Citation
 Salameh, BACumpstey, ISundin, ALeffler, HNilsson, UJ 1H-1,2,3-triazol-1-yl thiodigalactoside derivatives as high affinity galectin-3 inhibitors. Bioorg Med Chem 18:5367-78 (2010)  
Target
Name:
Galectin-7
Synonyms:
Gal-7 LEG7_HUMAN PI7 p53-induced gene 1 protein
Type:
Galactoside-binding protein
Mol. Mass.:
15077.89
Organism:
Homo sapiens (Human)
Description:
Residue:
136
  
Inhibitor
Name:
BDBM50326596
Synonyms:
CHEMBL1253187 | Di-(3-deoxy-3-(4-((allylamino)carbonyl)-1H-1,2,3-triazol-1-yl)-beta-D-galactopyranosyl)sulfane
Type:
Small organic molecule
Emp. Form.:
C24H34N8O10S
Mol. Mass.:
626.639
SMILES:
OC[C@H]1O[C@@H](S[C@@H]2O[C@H](CO)[C@H](O)[C@@H]([C@H]2O)n2cc(nn2)C(=O)NCC=C)[C@H](O)[C@H]([C@H]1O)n1cc(nn1)C(=O)NCC=C
: