Target
MBT domain-containing protein 1
Ligand
BDBM50330494
Substrate
Meas. Tech.
ChEMBL_684951 (CHEMBL1286366)
IC50
>100000±n/a nM
Citation
 Kireev, DWigle, TJNorris-Drouin, JHerold, JMJanzen, WPFrye, SV Identification of non-peptide malignant brain tumor (MBT) repeat antagonists by virtual screening of commercially available compounds. J Med Chem 53:7625-31 (2010)  
Target
Name:
MBT domain-containing protein 1
Synonyms:
MBT domain-containing protein 1 MBTD1 | MBTD1_HUMAN
Type:
Protein
Mol. Mass.:
70557.67
Organism:
Homo sapiens (Human)
Description:
Residue:
628
  
Inhibitor
Name:
BDBM50330494
Synonyms:
4-(4-benzylphenoxy)-N-methylbutan-1-amine | CHEMBL1190869
Type:
Small organic molecule
Emp. Form.:
C18H23NO
Mol. Mass.:
269.3813
SMILES:
CNCCCCOc1ccc(Cc2ccccc2)cc1
: