Target
Lethal(3)malignant brain tumor-like protein 4
Ligand
BDBM50330494
Substrate
Meas. Tech.
ChEMBL_684950 (CHEMBL1286365)
IC50
>100000±n/a nM
Citation
 Kireev, DWigle, TJNorris-Drouin, JHerold, JMJanzen, WPFrye, SV Identification of non-peptide malignant brain tumor (MBT) repeat antagonists by virtual screening of commercially available compounds. J Med Chem 53:7625-31 (2010)  
Target
Name:
Lethal(3)malignant brain tumor-like protein 4
Synonyms:
H-l(3)mbt-like protein 4 L3MBTL4 | LMBL4_HUMAN
Type:
PROTEIN
Mol. Mass.:
71132.81
Organism:
Homo sapiens (Human)
Description:
ChEMBL_983407
Residue:
623
  
Inhibitor
Name:
BDBM50330494
Synonyms:
4-(4-benzylphenoxy)-N-methylbutan-1-amine | CHEMBL1190869
Type:
Small organic molecule
Emp. Form.:
C18H23NO
Mol. Mass.:
269.3813
SMILES:
CNCCCCOc1ccc(Cc2ccccc2)cc1
: