Target
Insulin receptor
Ligand
BDBM50334087
Substrate
Meas. Tech.
ChEMBL_701401 (CHEMBL1649021)
IC50
231±n/a nM
Citation
 Weinberg, LRAlbom, MSAngeles, TSHusten, JLisko, JGMcHugh, RJMilkiewicz, KLMurthy, SOtt, GRTheroff, JPTripathy, RUnderiner, TLZificsak, CADorsey, BD Fused bicyclic derivatives of 2,4-diaminopyrimidine as c-Met inhibitors. Bioorg Med Chem Lett 21:164-7 (2010)  
Target
Name:
Insulin receptor
Synonyms:
INSR INSR_HUMAN Insulin receptor beta subunit
Type:
Receptor Tyrosine Kinase
Mol. Mass.:
156322.60
Organism:
Homo sapiens (Human)
Description:
P06213
Residue:
1382
  
Inhibitor
Name:
BDBM50334087
Synonyms:
2-{5-Chloro-2-[1-(2-methoxy-ethyl)-5,5-dimethyl-2-oxo-2,3,4,5-tetrahydro-1H-benzo[b]azepin-8-ylamino]-pyrimidin-4-ylamino}-3-fluoro-N-methyl-benzamide | CHEMBL1644815
Type:
Small organic molecule
Emp. Form.:
C27H30ClFN6O3
Mol. Mass.:
541.017
SMILES:
CNC(=O)c1cccc(F)c1Nc1nc(Nc2ccc3c(c2)N(CCOC)C(=O)CCC3(C)C)ncc1Cl
: