Target
Acetylcholinesterase
Ligand
BDBM10624
Substrate
Meas. Tech.
ChEMBL_699909 (CHEMBL1646128)
Ki
10±n/a nM
Citation
 Musilek, KRoder, JKomloova, MHolas, OHrabinova, MPohanka, MDohnal, VOpletalova, VKuca, KJung, YS Preparation, in vitro screening and molecular modelling of symmetrical 4-tert-butylpyridinium cholinesterase inhibitors--analogues of SAD-128. Bioorg Med Chem Lett 21:150-4 (2010)  
Target
Name:
Acetylcholinesterase
Synonyms:
ACES_HUMAN Acetylcholinesterase (AChE) | Acetylcholinesterase (human AChE)
Type:
Enzyme
Mol. Mass.:
67792.70
Organism:
Homo sapiens (Human)
Description:
P22303
Residue:
614
  
Inhibitor
Name:
BDBM10624
Synonyms:
1,5-bis(4-allyldimethylammoniumphenyl)-pentan-3-one dibromide BW284c51 CHEMBL464538
Type:
Small organic molecule
Emp. Form.:
C27H38N2O
Mol. Mass.:
406.6023
SMILES:
C[N+](C)(CC=C)c1ccc(CCC(=O)CCc2ccc(cc2)[N+](C)(C)CC=C)cc1
: