Target
Orotidine 5'-phosphate decarboxylase
Ligand
BDBM50341905
Substrate
Meas. Tech.
ChEMBL_743289 (CHEMBL1767488)
Ki
37000±n/a nM
Citation
 Lewis, MMeza-Avina, MEWei, LCrandall, IEBello, AMPoduch, ELiu, YPaige, CJKain, KCPai, EFKotra, LP Novel interactions of fluorinated nucleotide derivatives targeting orotidine 5'-monophosphate decarboxylase. J Med Chem 54:2891-901 (2011)  
Target
Name:
Orotidine 5'-phosphate decarboxylase
Synonyms:
OMP decarboxylase Orotidine 5-phosphate decarboxylase PYRF_METTH | pyrF
Type:
Enzyme
Mol. Mass.:
24909.45
Organism:
Methanobacterium thermoautotrophicum
Description:
Residue:
228
  
Inhibitor
Name:
BDBM50341905
Synonyms:
CHEMBL1765124 | ammonium 6-Cyano-2'-deoxy-2'-fluoro-beta-D-uridine 5'-O-Monophosphate
Type:
Small organic molecule
Emp. Form.:
C10H9FN3O7P
Mol. Mass.:
333.1676
SMILES:
O[C@@H]1[C@@H](CP([O-])([O-])=O)O[C@H]([C@@H]1F)n1c(cc(=O)[nH]c1=O)C#N
: