Target
Protein kinase C alpha type
Ligand
BDBM50342214
Substrate
Meas. Tech.
ChEMBL_743044 (CHEMBL1768515)
IC50
4810±n/a nM
Citation
 Djung, JFMears, RJMontalbetti, CACoulter, TSGolebiowski, ACarr, ANBarker, OGreis, KDZhou, SDolan, EDavis, GF The synthesis and evaluation of indolylureas as PKCa inhibitors. Bioorg Med Chem 19:2742-50 (2011)  
Target
Name:
Protein kinase C alpha type
Synonyms:
KPCA_HUMAN PKC alpha and beta-2 PKC-alpha PRKACA Protein Kinase C- alpha Protein kinase C alpha (PKCa) Protein kinase C alpha type (PRKCA) RAF proto-oncogene serine/threonine-protein kinase
Type:
Enzyme
Mol. Mass.:
76755.65
Organism:
Homo sapiens (Human)
Description:
The recombinant human PKC enzymes were produced using a baculovirus expression system in SF9 cells
Residue:
672
  
Inhibitor
Name:
BDBM50342214
Synonyms:
1-[1-(3-Diethylaminopropyl)-1H-indol-3-yl]-3-(2-phenylpyrimidin-4-yl)-urea | CHEMBL1766424
Type:
Small organic molecule
Emp. Form.:
C26H30N6O
Mol. Mass.:
442.556
SMILES:
CCN(CC)CCCn1cc(NC(=O)Nc2ccnc(n2)-c2ccccc2)c2ccccc12
: