Target
Sodium-dependent noradrenaline transporter
Ligand
BDBM50350021
Substrate
Meas. Tech.
ChEMBL_761643 (CHEMBL1816547)
IC50
17500±n/a nM
Citation
 Hudkins, RLRaddatz, RTao, MMathiasen, JRAimone, LDBecknell, NCProuty, CPKnutsen, LJYazdanian, MMoachon, GAtor, MAMallamo, JPMarino, MJBacon, ERWilliams, M Discovery and characterization of 6-{4-[3-(R)-2-methylpyrrolidin-1-yl)propoxy]phenyl}-2H-pyridazin-3-one (CEP-26401, irdabisant): a potent, selective histamine H3 receptor inverse agonist. J Med Chem 54:4781-92 (2011)  
Target
Name:
Sodium-dependent noradrenaline transporter
Synonyms:
Monoamine transporter NET Noradrenaline Transporter (NET) Norepinephrine transporter protein (NET) SLC6A2 Sodium-dependent noradrenaline transporter (NET) | Solute carrier family 6 member 2
Type:
Multi-pass membrane protein
Mol. Mass.:
69337.72
Organism:
Homo sapiens (Human)
Description:
P23975
Residue:
617
  
Inhibitor
Name:
BDBM50350021
Synonyms:
CHEMBL1813067
Type:
Small organic molecule
Emp. Form.:
C18H23N3O2
Mol. Mass.:
313.3941
SMILES:
C[C@@H]1CCCN1CCCOc1ccc(cc1)-c1ccc(=O)[nH]n1
: