Target
Solute carrier family 15 member 2
Ligand
BDBM84007
Substrate
Meas. Tech.
ChEMBL_762551 (CHEMBL1817008)
Ki
2600000±n/a nM
Citation
 Pedretti, ADe Luca, LMarconi, CRegazzoni, LAldini, GVistoli, G Fragmental modeling of hPepT2 and analysis of its binding features by docking studies and pharmacophore mapping. Bioorg Med Chem 19:4544-51 (2011)  
Target
Name:
Solute carrier family 15 member 2
Synonyms:
Kidney H(+)/peptide cotransporter PEPT2 S15A2_HUMAN | SLC15A2
Type:
PROTEIN
Mol. Mass.:
81795.62
Organism:
Homo sapiens (Human)
Description:
ChEMBL_762551
Residue:
729
  
Inhibitor
Name:
BDBM84007
Synonyms:
CEFIXIME MLS002222332 cid_5362065
Type:
Small organic molecule
Emp. Form.:
C16H15N5O7S2
Mol. Mass.:
453.45
SMILES:
Nc1nc(cs1)C(=N\OCC(O)=O)\C(=O)N[C@H]1[C@H]2SCC(C=C)=C(N2C1=O)C(O)=O
: