Target
Beta-secretase 1
Ligand
BDBM50379204
Substrate
Meas. Tech.
ChEMBL_811060 (CHEMBL2014640)
Kd
1300000±n/a nM
Citation
 Jordan, JBPoppe, LXia, XCheng, ACSun, YMichelsen, KEastwood, HSchnier, PDNixey, TZhong, W Fragment based drug discovery: practical implementation based on¹¿F NMR spectroscopy. J Med Chem 55:678-87 (2012)  
Target
Name:
Beta-secretase 1
Synonyms:
ASP2 Aspartyl protease 2 BACE1 Beta-secretase (BACE) Beta-secretase 1 (BACE 1) Beta-secretase 1 (BACE1) Beta-site amyloid precursor protein cleaving enzyme 1 Memapsin-2 beta-Secretase (BACE-1) | beta-Secretase (BACE1)
Type:
Protein
Mol. Mass.:
55755.10
Organism:
Homo sapiens (Human)
Description:
P56817
Residue:
501
  
Inhibitor
Name:
BDBM50379204
Synonyms:
4-Methylquinolin-2-amine | CHEMBL2011275
Type:
Small organic molecule
Emp. Form.:
C10H10N2
Mol. Mass.:
158.1998
SMILES:
Cc1cc(N)nc2ccccc12
: