Target
Serine/threonine-protein kinase TBK1
Ligand
BDBM50379363
Substrate
Meas. Tech.
ChEMBL_811983 (CHEMBL2013353)
EC50
12±n/a nM
Citation
 Wang, TBlock, MACowen, SDavies, AMDevereaux, EGingipalli, LJohannes, JLarsen, NASu, QTucker, JAWhitston, DWu, JZhang, HJZinda, MChuaqui, C Discovery of azabenzimidazole derivatives as potent, selective inhibitors of TBK1/IKKe kinases. Bioorg Med Chem Lett 22:2063-9 (2012)  
Target
Name:
Serine/threonine-protein kinase TBK1
Synonyms:
NAK Protein cereblon/Serine/threonine-protein kinase TBK1 TANK-binding kinase 1 (TBK-1) TBK1 | TBK1_HUMAN
Type:
protein
Mol. Mass.:
83645.20
Organism:
Homo sapiens (Human)
Description:
Q9UHD2
Residue:
729
  
Inhibitor
Name:
BDBM50379363
Synonyms:
CHEMBL2011941
Type:
Small organic molecule
Emp. Form.:
C27H35BrN6O2
Mol. Mass.:
555.51
SMILES:
Brc1cnc2nc([nH]c2c1NCCCNC(=O)C1CCC1)-c1ccc(OCCN2CCCCC2)cc1
: