Target
Serine/threonine-protein kinase TBK1
Ligand
BDBM50379366
Substrate
Meas. Tech.
ChEMBL_811983 (CHEMBL2013353)
EC50
35±n/a nM
Citation
 Wang, TBlock, MACowen, SDavies, AMDevereaux, EGingipalli, LJohannes, JLarsen, NASu, QTucker, JAWhitston, DWu, JZhang, HJZinda, MChuaqui, C Discovery of azabenzimidazole derivatives as potent, selective inhibitors of TBK1/IKKe kinases. Bioorg Med Chem Lett 22:2063-9 (2012)  
Target
Name:
Serine/threonine-protein kinase TBK1
Synonyms:
NAK Protein cereblon/Serine/threonine-protein kinase TBK1 TANK-binding kinase 1 (TBK-1) TBK1 | TBK1_HUMAN
Type:
protein
Mol. Mass.:
83645.20
Organism:
Homo sapiens (Human)
Description:
Q9UHD2
Residue:
729
  
Inhibitor
Name:
BDBM50379366
Synonyms:
CHEMBL2011944
Type:
Small organic molecule
Emp. Form.:
C21H24BrN5O3
Mol. Mass.:
474.351
SMILES:
COc1ccccc1-c1nc2ncc(Br)c(NCC(O)CNC(=O)C3CCC3)c2[nH]1
: