Target
Macrophage metalloelastase
Ligand
BDBM50379535
Substrate
Meas. Tech.
ChEMBL_811340 (CHEMBL2013520)
Ki
>50000±n/a nM
Citation
 Jiao, GSKim, SMoayeri, MCrown, DThai, ACregar-Hernandez, LMcKasson, LSankaran, BLehrer, AWong, TJohns, LMargosiak, SALeppla, SHJohnson, AT Antidotes to anthrax lethal factor intoxication. Part 3: Evaluation of core structures and further modifications to the C2-side chain. Bioorg Med Chem Lett 22:2242-6 (2012)  
Target
Name:
Macrophage metalloelastase
Synonyms:
HME MMP12_HUMAN Matrix metalloproteinase-12 (MMP 12) Matrix metalloproteinase-12 (MMP12) | Matrix metalloproteinases 12 (MMP-12)
Type:
Enzyme
Mol. Mass.:
54012.99
Organism:
Homo sapiens (Human)
Description:
P39900
Residue:
470
  
Inhibitor
Name:
BDBM50379535
Synonyms:
CHEMBL2010824
Type:
Small organic molecule
Emp. Form.:
C24H32F2N2O2
Mol. Mass.:
418.5199
SMILES:
CCC(NCCCC[C@@H](Cc1cc(C)c(F)c(C)c1)C(=O)NO)c1ccc(F)cc1
: