Target
Matrix metalloproteinase-9
Ligand
BDBM50340758
Substrate
Meas. Tech.
ChEMBL_811339 (CHEMBL2013519)
Ki
21000±n/a nM
Citation
 Jiao, GSKim, SMoayeri, MCrown, DThai, ACregar-Hernandez, LMcKasson, LSankaran, BLehrer, AWong, TJohns, LMargosiak, SALeppla, SHJohnson, AT Antidotes to anthrax lethal factor intoxication. Part 3: Evaluation of core structures and further modifications to the C2-side chain. Bioorg Med Chem Lett 22:2242-6 (2012)  
Target
Name:
Matrix metalloproteinase-9
Synonyms:
67 kDa matrix metalloproteinase-9 92 kDa gelatinase CLG4B Gelatinase B MMP9 Matrix metalloproteinase 9 (MMP-9) Matrix metalloproteinase-9 (MMP9)
Type:
Enzyme
Mol. Mass.:
78452.28
Organism:
Homo sapiens (Human)
Description:
P14780
Residue:
707
  
Inhibitor
Name:
BDBM50340758
Synonyms:
(S)-6-(4-fluorobenzylamino)-2-((R)-2-(4-fluorophenyl)-2-methoxyethyl)-N-hydroxyhexanamide | CHEMBL1760318
Type:
Small organic molecule
Emp. Form.:
C22H28F2N2O3
Mol. Mass.:
406.4661
SMILES:
CO[C@H](C[C@H](CCCCNCc1ccc(F)cc1)C(=O)NO)c1ccc(F)cc1
: