Target
Stromelysin-1
Ligand
BDBM50379534
Substrate
Meas. Tech.
ChEMBL_811338 (CHEMBL2013518)
Ki
>50000±n/a nM
Citation
 Jiao, GSKim, SMoayeri, MCrown, DThai, ACregar-Hernandez, LMcKasson, LSankaran, BLehrer, AWong, TJohns, LMargosiak, SALeppla, SHJohnson, AT Antidotes to anthrax lethal factor intoxication. Part 3: Evaluation of core structures and further modifications to the C2-side chain. Bioorg Med Chem Lett 22:2242-6 (2012)  
Target
Name:
Stromelysin-1
Synonyms:
MMP-3 MMP3_HUMAN Matrix metalloproteinase 3 Matrix metalloproteinase-3 (MMP-3) SL-1 Stromelysin 1 | Transin-1
Type:
Enzyme
Mol. Mass.:
53973.13
Organism:
Homo sapiens (Human)
Description:
P08254
Residue:
477
  
Inhibitor
Name:
BDBM50379534
Synonyms:
CHEMBL2012837
Type:
Small organic molecule
Emp. Form.:
C23H30F2N2O3
Mol. Mass.:
420.4927
SMILES:
CCC(NCCCC[C@@H](Oc1cc(C)c(F)c(C)c1)C(=O)NO)c1ccc(F)cc1
: