Target
Atypical chemokine receptor 3
Ligand
BDBM50380121
Substrate
Meas. Tech.
ChEMBL_811526 (CHEMBL2013880)
Ki
25.12±n/a nM
Citation
 Wijtmans, MMaussang, DSirci, FScholten, DJCanals, MMujic-Delic, AChong, MChatalic, KLCusters, HJanssen, Ede Graaf, CSmit, MJde Esch, IJLeurs, R Synthesis, modeling and functional activity of substituted styrene-amides as small-molecule CXCR7 agonists. Eur J Med Chem 51:184-92 (2012)  
Target
Name:
Atypical chemokine receptor 3
Synonyms:
ACKR3 C-X-C chemokine receptor type 7 CMKOR1 CXCR-7 Chemokine orphan receptor 1 G-protein coupled receptor RDC1 homolog RDC-1 | RDC1
Type:
Enzyme
Mol. Mass.:
41498.84
Organism:
Homo sapiens (Human)
Description:
P25106
Residue:
362
  
Inhibitor
Name:
BDBM50380121
Synonyms:
CHEMBL2013219
Type:
Small organic molecule
Emp. Form.:
C26H34N2O3
Mol. Mass.:
422.5598
SMILES:
COc1ccc(cc1OC)C(=O)N(CCC1CCCN1C)C\C(C)=C\c1ccccc1
: