Target
Carbonic anhydrase 13
Ligand
BDBM50380148
Substrate
Meas. Tech.
ChEMBL_811728 (CHEMBL2014303)
Kd
77±n/a nM
Citation
 Capkauskaite, EZubriene, ABaranauskiene, LTamulaitiene, GManakova, EKairys, VGražulis, STumkevicius, SMatulis, D Design of [(2-pyrimidinylthio)acetyl]benzenesulfonamides as inhibitors of human carbonic anhydrases. Eur J Med Chem 51:259-70 (2012)  
Target
Name:
Carbonic anhydrase 13
Synonyms:
CA13 Carbonic anhydrase Carbonic anhydrase XIII (CA XIII)
Type:
Enzyme
Mol. Mass.:
29445.78
Organism:
Homo sapiens (Human)
Description:
Q8N1Q1
Residue:
262
  
Inhibitor
Name:
BDBM50380148
Synonyms:
CHEMBL2011156 | carbonic anhydrase (CA) inhibitors, benzenesulphonamide ligand, 6
Type:
Small organic molecule
Emp. Form.:
C12H11N3O3S2
Mol. Mass.:
309.364
SMILES:
NS(=O)(=O)c1ccc(cc1)C(=O)CSc1ncccn1
: