Target
Cholinesterase
Ligand
BDBM50380550
Substrate
Meas. Tech.
ChEMBL_813112 (CHEMBL2020731)
IC50
0.85±n/a nM
Citation
 Fernández-Bachiller, MIPérez, CMonjas, LRademann, JRodríguez-Franco, MI New tacrine-4-oxo-4H-chromene hybrids as multifunctional agents for the treatment of Alzheimer's disease, with cholinergic, antioxidant, andß-amyloid-reducing properties. J Med Chem 55:1303-17 (2012)  
Target
Name:
Cholinesterase
Synonyms:
BCHE CHLE_HORSE | Cholinesterase
Type:
Enzyme
Mol. Mass.:
65643.35
Organism:
Equus caballus (Horse)
Description:
P81908
Residue:
574
  
Inhibitor
Name:
BDBM50380550
Synonyms:
CHEMBL2019041
Type:
Small organic molecule
Emp. Form.:
C35H42ClN3O5
Mol. Mass.:
620.178
SMILES:
COc1cc2oc(cc(=O)c2cc1OC)C(=O)NCCCCCCCCCCNc1c2CCCCc2nc2cc(Cl)ccc12
: