Target
Plasma kallikrein
Ligand
BDBM50380626
Substrate
Meas. Tech.
ChEMBL_813173 (CHEMBL2020839)
Ki
10.1±n/a nM
Citation
 Saupe, SMSteinmetzer, T A new strategy for the development of highly potent and selective plasmin inhibitors. J Med Chem 55:1171-80 (2012)  
Target
Name:
Plasma kallikrein
Synonyms:
Fletcher factor KLKB1 Kallikrein Plasma kallikrein heavy chain Plasma prekallikrein
Type:
Protein
Mol. Mass.:
71391.16
Organism:
Homo sapiens (Human)
Description:
P03952
Residue:
638
  
Inhibitor
Name:
BDBM50380626
Synonyms:
CHEMBL2016874
Type:
Small organic molecule
Emp. Form.:
C32H34N12O4S
Mol. Mass.:
682.755
SMILES:
NC(=N)c1ccc(CNC(=O)[C@@H]2Cc3cn(Cc4cccc(Cn5cc(C[C@@H](NS(=O)(=O)Cc6ccccc6)C(=O)N2)nn5)n4)nn3)cc1
: