Target
Coagulation factor X
Ligand
BDBM50380626
Substrate
Meas. Tech.
ChEMBL_813175 (CHEMBL2020841)
Ki
1860±n/a nM
Citation
 Saupe, SMSteinmetzer, T A new strategy for the development of highly potent and selective plasmin inhibitors. J Med Chem 55:1171-80 (2012)  
Target
Name:
Coagulation factor X
Synonyms:
Activated coagulation factor X (FXa) Coagulation factor X precursor F10 Factor X heavy chain Factor Xa Stuart-Prower factor
Type:
Enzyme
Mol. Mass.:
54726.60
Organism:
Homo sapiens (Human)
Description:
Residue:
488
  
Inhibitor
Name:
BDBM50380626
Synonyms:
CHEMBL2016874
Type:
Small organic molecule
Emp. Form.:
C32H34N12O4S
Mol. Mass.:
682.755
SMILES:
NC(=N)c1ccc(CNC(=O)[C@@H]2Cc3cn(Cc4cccc(Cn5cc(C[C@@H](NS(=O)(=O)Cc6ccccc6)C(=O)N2)nn5)n4)nn3)cc1
: