Target
Vasopressin V1a receptor
Ligand
BDBM50380757
Substrate
Meas. Tech.
ChEMBL_813469 (CHEMBL2019477)
Ki
16±n/a nM
Citation
 Smith, ALFreeman, SMStehouwer, JSInoue, KVoll, RJYoung, LJGoodman, MM Synthesis and evaluation of C-11, F-18 and I-125 small molecule radioligands for detecting oxytocin receptors. Bioorg Med Chem 20:2721-38 (2012)  
Target
Name:
Vasopressin V1a receptor
Synonyms:
AVPR V1a Avpr1a V1aR | Vascular/hepatic-type arginine vasopressin receptor
Type:
PROTEIN
Mol. Mass.:
47578.66
Organism:
Microtus ochrogaster
Description:
ChEMBL_813469
Residue:
420
  
Inhibitor
Name:
BDBM50380757
Synonyms:
CHEMBL2017868
Type:
Small organic molecule
Emp. Form.:
C31H38IN3O6S
Mol. Mass.:
707.619
SMILES:
CS(=O)(=O)N1CCC(CC1)Oc1ccc(CC(=O)N2CCC(CC2)N2C(=O)CCc3ccccc23)c(OC\C=C/I)c1
: