Target
Oxytocin receptor
Ligand
BDBM50380758
Substrate
Meas. Tech.
ChEMBL_813468 (CHEMBL2019476)
Ki
3.6±n/a nM
Citation
 Smith, ALFreeman, SMStehouwer, JSInoue, KVoll, RJYoung, LJGoodman, MM Synthesis and evaluation of C-11, F-18 and I-125 small molecule radioligands for detecting oxytocin receptors. Bioorg Med Chem 20:2721-38 (2012)  
Target
Name:
Oxytocin receptor
Synonyms:
OTR
Type:
PROTEIN
Mol. Mass.:
28131.82
Organism:
Microtus ochrogaster
Description:
ChEMBL_813468
Residue:
259
  
Inhibitor
Name:
BDBM50380758
Synonyms:
CHEMBL2017867
Type:
Small organic molecule
Emp. Form.:
C31H38IN3O6S
Mol. Mass.:
707.619
SMILES:
CS(=O)(=O)N1CCC(CC1)Oc1ccc(CC(=O)N2CCC(CC2)N2C(=O)CCc3ccccc23)c(OC\C=C\I)c1
: