Target
Vasopressin V1a receptor
Ligand
BDBM50380760
Substrate
Meas. Tech.
ChEMBL_813469 (CHEMBL2019477)
Ki
78±n/a nM
Citation
 Smith, ALFreeman, SMStehouwer, JSInoue, KVoll, RJYoung, LJGoodman, MM Synthesis and evaluation of C-11, F-18 and I-125 small molecule radioligands for detecting oxytocin receptors. Bioorg Med Chem 20:2721-38 (2012)  
Target
Name:
Vasopressin V1a receptor
Synonyms:
AVPR V1a Avpr1a V1aR | Vascular/hepatic-type arginine vasopressin receptor
Type:
PROTEIN
Mol. Mass.:
47578.66
Organism:
Microtus ochrogaster
Description:
ChEMBL_813469
Residue:
420
  
Inhibitor
Name:
BDBM50380760
Synonyms:
CHEMBL2017979
Type:
Small organic molecule
Emp. Form.:
C29H37N3O6S
Mol. Mass.:
555.686
SMILES:
COc1cc(OC2CCN(CC2)S(C)(=O)=O)ccc1CC(=O)N1CCC(CC1)N1C(=O)CCc2ccccc12
: