Target
Vasopressin V2 receptor
Ligand
BDBM50380760
Substrate
Meas. Tech.
ChEMBL_813473 (CHEMBL2019481)
Ki
3700±n/a nM
Citation
 Smith, ALFreeman, SMStehouwer, JSInoue, KVoll, RJYoung, LJGoodman, MM Synthesis and evaluation of C-11, F-18 and I-125 small molecule radioligands for detecting oxytocin receptors. Bioorg Med Chem 20:2721-38 (2012)  
Target
Name:
Vasopressin V2 receptor
Synonyms:
ADHR AVPR2 DIR Renal-type arginine vasopressin receptor V2R_HUMAN Vasopressin V2 receptor | Vasopressin receptor
Type:
Receptor
Mol. Mass.:
40295.28
Organism:
Homo sapiens (Human)
Description:
P30518
Residue:
371
  
Inhibitor
Name:
BDBM50380760
Synonyms:
CHEMBL2017979
Type:
Small organic molecule
Emp. Form.:
C29H37N3O6S
Mol. Mass.:
555.686
SMILES:
COc1cc(OC2CCN(CC2)S(C)(=O)=O)ccc1CC(=O)N1CCC(CC1)N1C(=O)CCc2ccccc12
: