Target
Vasopressin V2 receptor
Ligand
BDBM50380761
Substrate
Meas. Tech.
ChEMBL_813473 (CHEMBL2019481)
Ki
>1000±n/a nM
Citation
 Smith, ALFreeman, SMStehouwer, JSInoue, KVoll, RJYoung, LJGoodman, MM Synthesis and evaluation of C-11, F-18 and I-125 small molecule radioligands for detecting oxytocin receptors. Bioorg Med Chem 20:2721-38 (2012)  
Target
Name:
Vasopressin V2 receptor
Synonyms:
ADHR AVPR2 DIR Renal-type arginine vasopressin receptor V2R_HUMAN Vasopressin V2 receptor | Vasopressin receptor
Type:
Receptor
Mol. Mass.:
40295.28
Organism:
Homo sapiens (Human)
Description:
P30518
Residue:
371
  
Inhibitor
Name:
BDBM50380761
Synonyms:
CHEMBL2017980
Type:
Small organic molecule
Emp. Form.:
C28H35N3O6S
Mol. Mass.:
541.659
SMILES:
CS(=O)(=O)N1CCC(CC1)Oc1ccc(CC(=O)N2CCC(CC2)N2C(=O)CCc3ccccc23)c(O)c1
: