Target
Cannabinoid receptor 1
Ligand
BDBM50380892
Substrate
Meas. Tech.
ChEMBL_812807 (CHEMBL2020074)
Ki
4067±n/a nM
Citation
 Odan, MIshizuka, NHiramatsu, YInagaki, MHashizume, HFujii, YMitsumori, SMorioka, YSoga, MDeguchi, MYasui, KArimura, A Discovery of S-777469: an orally available CB2 agonist as an antipruritic agent. Bioorg Med Chem Lett 22:2803-6 (2012)  
Target
Name:
Cannabinoid receptor 1
Synonyms:
CANN6 CB-R CNR CNR1_HUMAN Cannabinoid receptor Cannabinoid receptor 1 (brain)
Type:
G Protein-Coupled Receptor (GPCR)
Mol. Mass.:
52868.96
Organism:
Homo sapiens (Human)
Description:
P21554
Residue:
472
  
Inhibitor
Name:
BDBM50380892
Synonyms:
CHEMBL2019090 | S-777469
Type:
Small organic molecule
Emp. Form.:
C23H27FN2O4
Mol. Mass.:
414.4699
SMILES:
CCc1c(C)cc(C(=O)NC2(CCCCC2)C(O)=O)c(=O)n1Cc1ccc(F)cc1
: