Target
Cannabinoid receptor 2
Ligand
BDBM50380892
Substrate
Meas. Tech.
ChEMBL_812810 (CHEMBL2020077)
IC50
24±n/a nM
Citation
 Odan, MIshizuka, NHiramatsu, YInagaki, MHashizume, HFujii, YMitsumori, SMorioka, YSoga, MDeguchi, MYasui, KArimura, A Discovery of S-777469: an orally available CB2 agonist as an antipruritic agent. Bioorg Med Chem Lett 22:2803-6 (2012)  
Target
Name:
Cannabinoid receptor 2
Synonyms:
CANNABINOID CB2 CB2 CB2B CNR2_HUMAN Cannabinoid CB2 receptor Cannabinoid receptor 2 (CB2R) | hCB2
Type:
G Protein-Coupled Receptor (GPCR)
Mol. Mass.:
39690.94
Organism:
Homo sapiens (Human)
Description:
P34972
Residue:
360
  
Inhibitor
Name:
BDBM50380892
Synonyms:
CHEMBL2019090 | S-777469
Type:
Small organic molecule
Emp. Form.:
C23H27FN2O4
Mol. Mass.:
414.4699
SMILES:
CCc1c(C)cc(C(=O)NC2(CCCCC2)C(O)=O)c(=O)n1Cc1ccc(F)cc1
: