Target
Ribosomal protein S6 kinase beta-1
Ligand
BDBM50380936
Substrate
Meas. Tech.
ChEMBL_814030 (CHEMBL2020582)
IC50
2±n/a nM
Citation
 Rice, KDKim, MHBussenius, JAnand, NKBlazey, CMBowles, OJCanne-Bannen, LChan, DSChen, BCo, EWCostanzo, SDeFina, SCDubenko, LEngst, SFranzini, MHuang, PJammalamadaka, VKhoury, RGKlein, RRLaird, ADLe, DTMac, MBMatthews, DJMarkby, DMiller, NNuss, JMParks, JJTsang, THTsuhako, ALWang, YXu, W Pyrazolopyrimidines as dual Akt/p70S6K inhibitors. Bioorg Med Chem Lett 22:2693-7 (2012)  
Target
Name:
Ribosomal protein S6 kinase beta-1
Synonyms:
70 kDa ribosomal protein S6 kinase 1 70 kDa ribosomal protein kinase (p70S6K) Protein kinase 70S6K (T412E) RPS6KB1 Ribosomal protein S6 kinase I STK14A p70S6K1
Type:
Enzyme
Mol. Mass.:
59139.89
Organism:
Homo sapiens (Human)
Description:
His-tagged S6K1.
Residue:
525
  
Inhibitor
Name:
BDBM50380936
Synonyms:
CHEMBL2016888
Type:
Small organic molecule
Emp. Form.:
C25H32BrF3N8O
Mol. Mass.:
597.474
SMILES:
Cc1c(NCCN2CCCC2)cc(COCC(F)(F)F)cc1N1CCN(CC1)c1ncnc2n[nH]c(Br)c12
: