Target
Vascular endothelial growth factor receptor 2
Ligand
BDBM50380968
Substrate
Meas. Tech.
ChEMBL_814082 (CHEMBL2020676)
IC50
0.7±n/a nM
Citation
 Han, SYChoi, JWYang, JChae, CHLee, JJung, HLee, KHa, JDKim, HRCho, SY Design and synthesis of 3-(4,5,6,7-tetrahydro-3H-imidazo[4,5-c]pyridin-2-yl)-1H-quinolin-2-ones as VEGFR-2 kinase inhibitors. Bioorg Med Chem Lett 22:2837-42 (2012)  
Target
Name:
Vascular endothelial growth factor receptor 2
Synonyms:
CD_antigen=CD309 Fetal liver kinase 1 (FLK-1) KDR Protein-tyrosine kinase receptor Flk-1 VEGFR-2 VEGFR2 Vascular Endothelial Growth Factor Receptor Kinase 2 Vascular endothelial growth factor receptor 2 (KDR) Vascular endothelial growth factor receptor 2 (VEGFR2) Vascular endothelial growth factor receptor-2 (VEGFR-2)
Type:
Receptor Tyrosine Kinase
Mol. Mass.:
151510.97
Organism:
Homo sapiens (Human)
Description:
P35968
Residue:
1356
  
Inhibitor
Name:
BDBM50380968
Synonyms:
CHEMBL2016924
Type:
Small organic molecule
Emp. Form.:
C22H18FN5O2
Mol. Mass.:
403.409
SMILES:
Fc1ccc2[nH]c(=O)c(cc2c1)-c1nc2CCN(Cc2[nH]1)C(=O)Cc1ccccn1
: