Target
cAMP-specific 3',5'-cyclic phosphodiesterase 4D
Ligand
BDBM14774
Substrate
Meas. Tech.
ChEMBL_814385 (CHEMBL2019709)
IC50
460±n/a nM
Citation
 Chen, SKZhao, PShao, YXLi, ZZhang, CLiu, PHe, XLuo, HBHu, X Moracin M from Morus alba L. is a natural phosphodiesterase-4 inhibitor. Bioorg Med Chem Lett 22:3261-4 (2012)  
Target
Name:
cAMP-specific 3',5'-cyclic phosphodiesterase 4D
Synonyms:
3',5'-cyclic phosphodiesterase PDE43 PDE4D_HUMAN | Phosphodiesterase 4D
Type:
Protein
Mol. Mass.:
91092.69
Organism:
Homo sapiens (Human)
Description:
Q08499
Residue:
809
  
Inhibitor
Name:
BDBM14774
Synonyms:
3-(cyclopropylmethoxy)-N-(3,5-dichloropyridin-4-yl)-4-(difluoromethoxy)benzamide DAXAS Roflumilast
Type:
Small organic molecule
Emp. Form.:
C17H14Cl2F2N2O3
Mol. Mass.:
403.207
SMILES:
FC(F)Oc1ccc(cc1OCC1CC1)C(=O)Nc1c(Cl)cncc1Cl
: