Target
Glucocorticoid receptor
Ligand
BDBM50381730
Substrate
Meas. Tech.
ChEMBL_816569 (CHEMBL2025283)
IC50
29.2±n/a nM
Citation
 Biju, PWang, HAnthes, JMcCormick, KAslanian, RBerlin, MBitar, RLim, YHLee, YJPrelusky, DMcleod, RJia, YFernandez, XLieber, GJimenez, JEckel, SHouse, AChapman, RPhillips, J Steroidal C-21 heteroaryl thioethers. Part 3: pregn-4-eno-[3,2-c]pyrazole fused A ring modified steroids as selective glucocorticoid receptor modulators (dissociated steroids). Bioorg Med Chem Lett 22:3291-5 (2012)  
Target
Name:
Glucocorticoid receptor
Synonyms:
GCR_HUMAN GRL Glucocorticoid receptor (GRFP) Nuclear receptor subfamily 3 group C member 1
Type:
Enzyme
Mol. Mass.:
85656.87
Organism:
Homo sapiens (Human)
Description:
P04150
Residue:
777
  
Inhibitor
Name:
BDBM50381730
Synonyms:
CHEMBL2023244
Type:
Small organic molecule
Emp. Form.:
C38H39FN2O4
Mol. Mass.:
606.7257
SMILES:
C[C@]12C[C@H](O)[C@H]3[C@@H](CCC4=Cc5c(C[C@]34C)cnn5-c3ccc(F)cc3)[C@@H]1CC[C@]2(O)C(=O)COc1ccc2ccccc2c1
: