Target
Cannabinoid receptor 2
Ligand
BDBM50200170
Substrate
Meas. Tech.
ChEMBL_817534 (CHEMBL2027757)
Ki
4.35±n/a nM
Citation
 Manera, CSaccomanni, GMalfitano, AMBertini, SCastelli, FLaezza, CLigresti, ALucchesi, VTuccinardi, TRizzolio, FBifulco, MDi Marzo, VGiordano, AMacchia, MMartinelli, A Rational design, synthesis and anti-proliferative properties of new CB2 selective cannabinoid receptor ligands: an investigation of the 1,8-naphthyridin-2(1H)-one scaffold. Eur J Med Chem 52:284-94 (2012)  
Target
Name:
Cannabinoid receptor 2
Synonyms:
CANNABINOID CB2 CB2 CB2B CNR2_HUMAN Cannabinoid CB2 receptor Cannabinoid receptor 2 (CB2R) | hCB2
Type:
G Protein-Coupled Receptor (GPCR)
Mol. Mass.:
39690.94
Organism:
Homo sapiens (Human)
Description:
P34972
Residue:
360
  
Inhibitor
Name:
BDBM50200170
Synonyms:
5-(4-chloro-3-methyl-phenyl)-1-(4-methyl-benzyl)-1H-pyrazole-3-carboxylic acid ((1S,2S,4R)-1,3,3-trimethyl-bicyclo[2.2.1]hept-2-yl)-amide CHEMBL381791 | SR-144528
Type:
Small organic molecule
Emp. Form.:
C29H34ClN3O
Mol. Mass.:
476.053
SMILES:
Cc1ccc(Cn2nc(cc2-c2ccc(Cl)c(C)c2)C(=O)N[C@H]2[C@@]3(C)CC[C@H](C3)C2(C)C)cc1
: