Target
Cannabinoid receptor 2
Ligand
BDBM50381875
Substrate
Meas. Tech.
ChEMBL_817534 (CHEMBL2027757)
Ki
25±n/a nM
Citation
 Manera, CSaccomanni, GMalfitano, AMBertini, SCastelli, FLaezza, CLigresti, ALucchesi, VTuccinardi, TRizzolio, FBifulco, MDi Marzo, VGiordano, AMacchia, MMartinelli, A Rational design, synthesis and anti-proliferative properties of new CB2 selective cannabinoid receptor ligands: an investigation of the 1,8-naphthyridin-2(1H)-one scaffold. Eur J Med Chem 52:284-94 (2012)  
Target
Name:
Cannabinoid receptor 2
Synonyms:
CANNABINOID CB2 CB2 CB2B CNR2_HUMAN Cannabinoid CB2 receptor Cannabinoid receptor 2 (CB2R) | hCB2
Type:
G Protein-Coupled Receptor (GPCR)
Mol. Mass.:
39690.94
Organism:
Homo sapiens (Human)
Description:
P34972
Residue:
360
  
Inhibitor
Name:
BDBM50381875
Synonyms:
CHEMBL2022703
Type:
Small organic molecule
Emp. Form.:
C20H23FN2O2
Mol. Mass.:
342.4072
SMILES:
Fc1ccc(COc2ncccc2C(=O)NC2CCCCCC2)cc1
: