Target
Cannabinoid receptor 2
Ligand
BDBM50381882
Substrate
Meas. Tech.
ChEMBL_817534 (CHEMBL2027757)
Ki
1.8±n/a nM
Citation
 Manera, CSaccomanni, GMalfitano, AMBertini, SCastelli, FLaezza, CLigresti, ALucchesi, VTuccinardi, TRizzolio, FBifulco, MDi Marzo, VGiordano, AMacchia, MMartinelli, A Rational design, synthesis and anti-proliferative properties of new CB2 selective cannabinoid receptor ligands: an investigation of the 1,8-naphthyridin-2(1H)-one scaffold. Eur J Med Chem 52:284-94 (2012)  
Target
Name:
Cannabinoid receptor 2
Synonyms:
CANNABINOID CB2 CB2 CB2B CNR2_HUMAN Cannabinoid CB2 receptor Cannabinoid receptor 2 (CB2R) | hCB2
Type:
G Protein-Coupled Receptor (GPCR)
Mol. Mass.:
39690.94
Organism:
Homo sapiens (Human)
Description:
P34972
Residue:
360
  
Inhibitor
Name:
BDBM50381882
Synonyms:
CHEMBL2022694
Type:
Small organic molecule
Emp. Form.:
C22H30N4O4
Mol. Mass.:
414.498
SMILES:
Oc1c(C(=O)NC2CCCCCC2)c(=O)n(CCN2CCOCC2)c2ncccc12
: