Target
Cannabinoid receptor 1
Ligand
BDBM50381888
Substrate
Meas. Tech.
ChEMBL_817533 (CHEMBL2027756)
Ki
16.5±n/a nM
Citation
 Manera, CSaccomanni, GMalfitano, AMBertini, SCastelli, FLaezza, CLigresti, ALucchesi, VTuccinardi, TRizzolio, FBifulco, MDi Marzo, VGiordano, AMacchia, MMartinelli, A Rational design, synthesis and anti-proliferative properties of new CB2 selective cannabinoid receptor ligands: an investigation of the 1,8-naphthyridin-2(1H)-one scaffold. Eur J Med Chem 52:284-94 (2012)  
Target
Name:
Cannabinoid receptor 1
Synonyms:
CANN6 CB-R CNR CNR1_HUMAN Cannabinoid receptor Cannabinoid receptor 1 (brain)
Type:
G Protein-Coupled Receptor (GPCR)
Mol. Mass.:
52868.96
Organism:
Homo sapiens (Human)
Description:
P21554
Residue:
472
  
Inhibitor
Name:
BDBM50381888
Synonyms:
CHEMBL2022361
Type:
Small organic molecule
Emp. Form.:
C23H23FN2O2
Mol. Mass.:
378.4393
SMILES:
Fc1ccc(Cn2c3ccccc3cc(C(=O)NC3CCCCC3)c2=O)cc1
: