Target
Serine/threonine-protein kinase Chk1
Ligand
BDBM50381998
Substrate
Meas. Tech.
ChEMBL_815114 (CHEMBL2024839)
IC50
300±n/a nM
Citation
 Voss, MERainka, MPFleming, MPeterson, LHBelanger, DBSiddiqui, MAHruza, AVoigt, JGray, KBasso, AD Synthesis and SAR studies of imidazo-[1,2-a]-pyrazine Aurora kinase inhibitors with improved off-target kinase selectivity. Bioorg Med Chem Lett 22:3544-9 (2012)  
Target
Name:
Serine/threonine-protein kinase Chk1
Synonyms:
CHEK1 CHK1 checkpoint homolog Checkpoint kinase-1 (CHK1)
Type:
Enzyme Catalytic Domain
Mol. Mass.:
54443.02
Organism:
Homo sapiens (Human)
Description:
gi_166295192
Residue:
476
  
Inhibitor
Name:
BDBM50381998
Synonyms:
CHEMBL2022711
Type:
Small organic molecule
Emp. Form.:
C27H29FN10OS
Mol. Mass.:
560.649
SMILES:
CC1CCCN(Cc2cc(Nc3nc(C)cn4c(cnc34)-c3cnn(CC(=O)Nc4ccncc4F)c3)sn2)C1
: