Target
Aurora kinase B
Ligand
BDBM50382000
Substrate
Meas. Tech.
ChEMBL_815111 (CHEMBL2024836)
EC50
>1000±n/a nM
Citation
 Voss, MERainka, MPFleming, MPeterson, LHBelanger, DBSiddiqui, MAHruza, AVoigt, JGray, KBasso, AD Synthesis and SAR studies of imidazo-[1,2-a]-pyrazine Aurora kinase inhibitors with improved off-target kinase selectivity. Bioorg Med Chem Lett 22:3544-9 (2012)  
Target
Name:
Aurora kinase B
Synonyms:
AIK2 AIM1 ARK2 AURKB_HUMAN Aurora B-INCENP Aurora kinase B (AURKB) STK-1 STK12 Serine/threonine-protein kinase aurora B
Type:
Protein
Mol. Mass.:
39327.72
Organism:
Homo sapiens (Human)
Description:
Q96GD4
Residue:
344
  
Inhibitor
Name:
BDBM50382000
Synonyms:
CHEMBL2022116
Type:
Small organic molecule
Emp. Form.:
C26H35N9OS
Mol. Mass.:
521.681
SMILES:
CC(C)CCNC(=O)Cn1cc(cn1)-c1cnc2c(Nc3cc(CN4CCCCC4)ns3)nc(C)cn12
: