Target
Tyrosine-protein kinase Lck
Ligand
BDBM50381998
Substrate
Meas. Tech.
ChEMBL_815113 (CHEMBL2024838)
IC50
271±n/a nM
Citation
 Voss, MERainka, MPFleming, MPeterson, LHBelanger, DBSiddiqui, MAHruza, AVoigt, JGray, KBasso, AD Synthesis and SAR studies of imidazo-[1,2-a]-pyrazine Aurora kinase inhibitors with improved off-target kinase selectivity. Bioorg Med Chem Lett 22:3544-9 (2012)  
Target
Name:
Tyrosine-protein kinase Lck
Synonyms:
2.7.10.2 LCK_HUMAN Leukocyte C-terminal Src kinase Lymphocyte-specific protein tyrosine kinase Protein YT16 Proto-oncogene tyrosine-protein kinase LCK T cell-specific protein-tyrosine kinase
Type:
Mol. Mass.:
57987.83
Organism:
Homo sapiens (Human)
Description:
P06239
Residue:
509
  
Inhibitor
Name:
BDBM50381998
Synonyms:
CHEMBL2022711
Type:
Small organic molecule
Emp. Form.:
C27H29FN10OS
Mol. Mass.:
560.649
SMILES:
CC1CCCN(Cc2cc(Nc3nc(C)cn4c(cnc34)-c3cnn(CC(=O)Nc4ccncc4F)c3)sn2)C1
: