Target
Aldo-keto reductase family 1 member C3
Ligand
BDBM50382163
Substrate
Meas. Tech.
ChEMBL_815555 (CHEMBL2025084)
IC50
80±n/a nM
Citation
 Chen, MAdeniji, AOTwenter, BMWinkler, JDChristianson, DWPenning, TM Crystal structures of AKR1C3 containing an N-(aryl)amino-benzoate inhibitor and a bifunctional AKR1C3 inhibitor and androgen receptor antagonist. Therapeutic leads for castrate resistant prostate cancer. Bioorg Med Chem Lett 22:3492-7 (2012)  
Target
Name:
Aldo-keto reductase family 1 member C3
Synonyms:
17-beta-Hydroxysteroid Dehydrogenase 5 (17-beta-HSD5, AKR1C3) AK1C3_HUMAN Aldo-keto reductase family 1 member C3 Aldo-keto reductase family 1 member C3 (AK1C3a) Aldo-keto-reductase family 1 member C3 Dihydrodiol dehydrogenase 3 Estradiol 17-beta-dehydrogenase KIAA0119 Prostaglandin F synthase Trans-1,2-dihydrobenzene-1,2-diol dehydrogenase
Type:
Enzyme
Mol. Mass.:
36859.86
Organism:
Homo sapiens (Human)
Description:
P42330
Residue:
323
  
Inhibitor
Name:
BDBM50382163
Synonyms:
CHEMBL2023820
Type:
Small organic molecule
Emp. Form.:
C17H12N2O4
Mol. Mass.:
308.2882
SMILES:
OC(=O)c1cccc(Nc2ccc([N+]([O-])=O)c3ccccc23)c1
: