Target
Androgen receptor
Ligand
BDBM50382163
Substrate
Meas. Tech.
ChEMBL_815556 (CHEMBL2025085)
IC50
4700±n/a nM
Citation
 Chen, MAdeniji, AOTwenter, BMWinkler, JDChristianson, DWPenning, TM Crystal structures of AKR1C3 containing an N-(aryl)amino-benzoate inhibitor and a bifunctional AKR1C3 inhibitor and androgen receptor antagonist. Therapeutic leads for castrate resistant prostate cancer. Bioorg Med Chem Lett 22:3492-7 (2012)  
Target
Name:
Androgen receptor
Synonyms:
ANDR_HUMAN Androgen Receptor Androgen receptor/Baculoviral IAP repeat-containing protein 2 Dihydrotestosterone receptor Nuclear receptor subfamily 3 group C member 4
Type:
Receptor
Mol. Mass.:
99185.27
Organism:
Homo sapiens (Human)
Description:
CHO cells were stably transfected with human AR gene.
Residue:
920
  
Inhibitor
Name:
BDBM50382163
Synonyms:
CHEMBL2023820
Type:
Small organic molecule
Emp. Form.:
C17H12N2O4
Mol. Mass.:
308.2882
SMILES:
OC(=O)c1cccc(Nc2ccc([N+]([O-])=O)c3ccccc23)c1
: