Target
Aldo-keto reductase family 1 member C1
Ligand
BDBM50337281
Substrate
Meas. Tech.
ChEMBL_815557 (CHEMBL2025086)
IC50
6740±n/a nM
Citation
 Chen, MAdeniji, AOTwenter, BMWinkler, JDChristianson, DWPenning, TM Crystal structures of AKR1C3 containing an N-(aryl)amino-benzoate inhibitor and a bifunctional AKR1C3 inhibitor and androgen receptor antagonist. Therapeutic leads for castrate resistant prostate cancer. Bioorg Med Chem Lett 22:3492-7 (2012)  
Target
Name:
Aldo-keto reductase family 1 member C1
Synonyms:
20-alpha-HSD AK1C1_HUMAN Aldo-keto reductase family 1 member C1 (AK1C1) Aldo-keto reductase family 1 member C1 (AKR1C1) DDH High-affinity hepatic bile acid-binding protein | Trans-1,2-dihydrobenzene-1,2-diol dehydrogenase
Type:
Enzyme
Mol. Mass.:
36793.97
Organism:
Homo sapiens (Human)
Description:
Recombinant AKR1C1 enzyme was expressed in E. coli.
Residue:
323
  
Inhibitor
Name:
BDBM50337281
Synonyms:
3-[N-(4-nitrophenyl)amino]benzoic acid US9271961, 5
Type:
Small organic molecule
Emp. Form.:
C13H10N2O4
Mol. Mass.:
258.2295
SMILES:
OC(=O)c1cccc(Nc2ccc(cc2)[N+]([O-])=O)c1
: