Target
Prostaglandin G/H synthase 1
Ligand
BDBM50337281
Substrate
Meas. Tech.
ChEMBL_815552 (CHEMBL2025081)
IC50
30760±n/a nM
Citation
 Chen, MAdeniji, AOTwenter, BMWinkler, JDChristianson, DWPenning, TM Crystal structures of AKR1C3 containing an N-(aryl)amino-benzoate inhibitor and a bifunctional AKR1C3 inhibitor and androgen receptor antagonist. Therapeutic leads for castrate resistant prostate cancer. Bioorg Med Chem Lett 22:3492-7 (2012)  
Target
Name:
Prostaglandin G/H synthase 1
Synonyms:
COX-1 Cyclooxygenase Cyclooxygenase-1 (COX-1) PTGS1 | Prostaglandin G/H synthase (cyclooxygenase)
Type:
Enzyme
Mol. Mass.:
68692.62
Organism:
Homo sapiens (Human)
Description:
P23219
Residue:
599
  
Inhibitor
Name:
BDBM50337281
Synonyms:
3-[N-(4-nitrophenyl)amino]benzoic acid US9271961, 5
Type:
Small organic molecule
Emp. Form.:
C13H10N2O4
Mol. Mass.:
258.2295
SMILES:
OC(=O)c1cccc(Nc2ccc(cc2)[N+]([O-])=O)c1
: