Target
Signal transducer and activator of transcription 1-alpha/beta
Ligand
BDBM50382460
Substrate
Meas. Tech.
ChEMBL_815759 (CHEMBL2025843)
Ki
3200±n/a nM
Citation
 Page, BDKhoury, HLaister, RCFletcher, SVellozo, MManzoli, AYue, PTurkson, JMinden, MDGunning, PT Small molecule STAT5-SH2 domain inhibitors exhibit potent antileukemia activity. J Med Chem 55:1047-55 (2012)  
Target
Name:
Signal transducer and activator of transcription 1-alpha/beta
Synonyms:
STAT1 Signal transducer and activator of transcription 1-alpha/beta Transcription factor ISGF-3 components p91/p84 | signal transducer and activator of transcription 1 isoform alpha
Type:
Cytosolic Transcription Factor
Mol. Mass.:
87327.69
Organism:
Homo sapiens (Human)
Description:
Stat1 was expressed in sf9 cells from a baculovirus encoding the recombinant proteins. Stat1 dimer binds to DNA.
Residue:
750
  
Inhibitor
Name:
BDBM50382460
Synonyms:
CHEMBL2023985 | US10196373, Compound 27NA
Type:
Small organic molecule
Emp. Form.:
C38H34N2O8S
Mol. Mass.:
678.75
SMILES:
COC(=O)c1cccc(c1)-c1ccc(cc1)-c1ccc(CN(C(=O)CN(C)S(=O)(=O)c2ccc(C)cc2)c2ccc(C(O)=O)c(O)c2)cc1
: