Target
Glycogen phosphorylase, muscle form
Ligand
BDBM50049400
Substrate
Meas. Tech.
ChEMBL_818388 (CHEMBL2034615)
IC50
20900±n/a nM
Citation
 Krimm, ILancelin, JMPraly, JP Binding evaluation of fragment-based scaffolds for probing allosteric enzymes. J Med Chem 55:1287-95 (2012)  
Target
Name:
Glycogen phosphorylase, muscle form
Synonyms:
Glycogen Phosphorylase (PYGM) Glycogen phosphorylase, muscle form PYGM | PYGM_RABIT
Type:
Enzyme
Mol. Mass.:
97296.32
Organism:
Oryctolagus cuniculus (rabbit)
Description:
Phosphorylation of Ser-15 converts phosphorylase B (unphosphorylated) to phosphorylase A.
Residue:
843
  
Inhibitor
Name:
BDBM50049400
Synonyms:
(+/-) taxifolin (+/-)-taxifolin (2R,3R)-2-(3,4-dihydroxyphenyl)-3,5,7-trihydroxychroman-4-one 2-(3,4-dihydroxyphenyl)-3,5,7-trihydroxychroman-4-one CHEMBL337309 | NSC-2801
Type:
Small organic molecule
Emp. Form.:
C15H12O7
Mol. Mass.:
304.2516
SMILES:
OC1C(=O)C(Oc2cc(O)cc(O)c12)c1ccc(O)c(O)c1
: