Target
Cytosolic beta-glucosidase
Ligand
BDBM50383315
Substrate
Meas. Tech.
ChEMBL_820008 (CHEMBL2032683)
IC50
2000±n/a nM
Citation
 Goddard-Borger, EDTropak, MBYonekawa, STysoe, CMahuran, DJWithers, SG Rapid assembly of a library of lipophilic iminosugars via the thiol-ene reaction yields promising pharmacological chaperones for the treatment of Gaucher disease. J Med Chem 55:2737-45 (2012)  
Target
Name:
Cytosolic beta-glucosidase
Synonyms:
Beta-glucosidase cytosolic CBGL1 GBA3_HUMAN
Type:
PROTEIN
Mol. Mass.:
53687.94
Organism:
Homo sapiens (Human)
Description:
ChEMBL_820008
Residue:
469
  
Inhibitor
Name:
BDBM50383315
Synonyms:
CHEMBL2029773
Type:
Small organic molecule
Emp. Form.:
C15H31NO3S
Mol. Mass.:
305.477
SMILES:
CCCCCCCCSCC[C@H]1NC[C@@H](O)[C@H](O)[C@H]1O
: