Target
Cholesteryl ester transfer protein
Ligand
BDBM50383595
Substrate
Meas. Tech.
ChEMBL_818747 (CHEMBL2033274)
IC50
74±n/a nM
Citation
 Escribano, AMateo, AIMartin de la Nava, EMMayhugh, DRCockerham, SLBeyer, TPSchmidt, RJCao, GZhang, YJones, TMBorel, AGSweetana, SACannady, EAMantlo, NB Design and synthesis of new tetrahydroquinolines derivatives as CETP inhibitors. Bioorg Med Chem Lett 22:3671-5 (2012)  
Target
Name:
Cholesteryl ester transfer protein
Synonyms:
CETP Cholesteryl ester transfer protein (CETP) | Lipid transfer protein I
Type:
Enzyme
Mol. Mass.:
54751.53
Organism:
Homo sapiens (Human)
Description:
P11597
Residue:
493
  
Inhibitor
Name:
BDBM50383595
Synonyms:
CHEMBL2032427
Type:
Small organic molecule
Emp. Form.:
C29H31F9N6O2
Mol. Mass.:
666.5811
SMILES:
CCCn1nnc(n1)N(Cc1cc(cc(c1)C(F)(F)F)C(F)(F)F)[C@H]1C[C@@H](CC)N(C(=O)OC(C)C)c2ccc(cc12)C(F)(F)F
: